Building modules, stage 2. * Preparing vmnet module Using 2.6.x kernel build system. make[1]: warning: jobserver unavailable: using -j1. Add `+' to parent make rule. /var/tmp/portage/app-emulation/vmware-modules-1.0.0.16/work/vmnet-only/userif.c: In function ‘VNetCopyDatagramToUser’: /var/tmp/portage/app-emulation/vmware-modules-1.0.0.16/work/vmnet-only/userif.c:630: error: ‘const struct sk_buff’ has no member named ‘h’ /var/tmp/portage/app-emulation/vmware-modules-1.0.0.16/work/vmnet-only/userif.c:630: error: ‘const struct sk_buff’ has no member named ‘nh’ /var/tmp/portage/app-emulation/vmware-modules-1.0.0.16/work/vmnet-only/userif.c:636: error: ‘const struct sk_buff’ has no member named ‘h’ make[3]: *** [/var/tmp/portage/app-emulation/vmware-modules-1.0.0.16/work/vmnet-only/userif.o] Error 1 make[2]: *** [_module_/var/tmp/portage/app-emulation/vmware-modules-1.0.0.16/work/vmnet-only] Error 2 make[1]: *** [modules] Error 2 make: *** [vmnet.ko] Error 2 !!! ERROR: app-emulation/vmware-modules-1.0.0.16 failed. Call stack: ebuild.sh, line 1621: Called dyn_compile ebuild.sh, line 973: Called qa_call 'src_compile' ebuild.sh, line 44: Called src_compile ebuild.sh, line 1311: Called linux-mod_src_compile linux-mod.eclass, line 516: Called die !!! Unable to make auto-build VMWARE_VER=VME_V6 KERNEL_DIR=/usr/src/linux KBUILD_OUTPUT=/lib/modules/2.6.22-sabayon/build. !!! If you need support, post the topmost build error, and the call stack if relevant. !!! A complete build log is located at '/var/tmp/portage/app-emulation/vmware-modules-1.0.0.16/temp/build.log'.