sysutil.c: In function 'vsf_sysutil_wait_exited_normally': sysutil.c:602: error: assignment of read-only member '__in' sysutil.c: In function 'vsf_sysutil_wait_get_exitcode': sysutil.c:612: error: assignment of read-only member '__in' sysutil.c: In function 'vsf_sysutil_connect_timeout': sysutil.c:1719: warning: pointer targets in passing argument 5 of 'getsockopt' differ in signedness make: *** [sysutil.o] Error 1 if [ -x /usr/local/sbin ]; then \ install -m 755 vsftpd /usr/local/sbin/vsftpd; \ else \ install -m 755 vsftpd /usr/sbin/vsftpd; fi install: cannot stat `vsftpd': No such file or directory make: *** [install] Error 1