Building the vmnet module. Using 2.6.x kernel build system. make: Entering directory `/tmp/vmware-config0/vmnet-only' make -C /lib/modules/2.6.22-1-686/build/include/.. SUBDIRS=$PWD SRCROOT=$PWD/. modules make[1]: Entering directory `/usr/src/linux-headers-2.6.22-1-686' CC [M] /tmp/vmware-config0/vmnet-only/driver.o CC [M] /tmp/vmware-config0/vmnet-only/hub.o CC [M] /tmp/vmware-config0/vmnet-only/userif.o /tmp/vmware-config0/vmnet-only/userif.c: In function ‘VNetCopyDatagramToUser’: /tmp/vmware-config0/vmnet-only/userif.c:630: error: ‘const struct sk_buff’ has no member named ‘h’ /tmp/vmware-config0/vmnet-only/userif.c:630: error: ‘const struct sk_buff’ has no member named ‘nh’ /tmp/vmware-config0/vmnet-only/userif.c:636: error: ‘const struct sk_buff’ has no member named ‘h’ make[2]: *** [/tmp/vmware-config0/vmnet-only/userif.o] Fehler 1 make[1]: *** [_module_/tmp/vmware-config0/vmnet-only] Fehler 2 make[1]: Leaving directory `/usr/src/linux-headers-2.6.22-1-686' make: *** [vmnet.ko] Fehler 2 make: Leaving directory `/tmp/vmware-config0/vmnet-only' Unable to build the vmnet module. For more information on how to troubleshoot module-related problems, please visit our Web site at "http://www.vmware.com/download/modules/modules.html" and "http://www.vmware.com/support/reference/linux/prebuilt_modules_linux.html". Execution aborted.