In file included from app_securax_serverload.c:17: ../include/asterisk/file.h:27:2: #error You must include stdio.h before file.h! In file included from app_securax_serverload.c:17: ../include/asterisk/file.h:56: error: syntax error before '*' token ../include/asterisk/file.h:56: warning: function declaration isn't a prototype ../include/asterisk/file.h:57: error: syntax error before '*' token ../include/asterisk/file.h:57: warning: function declaration isn't a prototype app_securax_serverload.c: In function `scx_load_config': app_securax_serverload.c:74: warning: implicit declaration of function `ast_load' app_securax_serverload.c:74: warning: initialization makes pointer from integer without a cast app_securax_serverload.c:85: warning: implicit declaration of function `ast_destroy' app_securax_serverload.c: In function `scx_load': app_securax_serverload.c:97: warning: passing arg 3 of `ast_pthread_create_stack' from incompatible pointer type make[1]: *** [app_securax_serverload.o] Error 1 make[1]: Leaving directory `/usr/src/asterisk-1.2.9.1/apps' make: *** [subdirs] Error 1