g++ -DHAVE_CONFIG_H -I. -I/home/patrick/minisplat-20060619/libsplcrypto/source/openssl -I../../include -I/home/patrick/minisplat-20060619/libsplcrypto/include -I/home/patrick/minisplat-20060619/libsplutil/include -Wall -MT libmcopenssl_la-pke.lo -MD -MP -MF .deps/libmcopenssl_la-pke.Tpo -c /home/patrick/minisplat-20060619/libsplcrypto/source/openssl/pke.cxx -fPIC -DPIC -o .libs/libmcopenssl_la-pke.o /home/patrick/minisplat-20060619/libsplcrypto/source/openssl/pke.cxx: In member function 'void PrivateKey::sign(byte_t*, size_t, byte_t*, size_t*)': /home/patrick/minisplat-20060619/libsplcrypto/source/openssl/pke.cxx:62: error: cannot convert 'size_t*' to 'unsigned int*' for argument '3' to 'int EVP_SignFinal(EVP_MD_CTX*, unsigned char*, unsigned int*, EVP_PKEY*)' /home/patrick/minisplat-20060619/libsplcrypto/source/openssl/pke.cxx: In member function 'size_t PublicKey::encryptMaxLen()': /home/patrick/minisplat-20060619/libsplcrypto/source/openssl/pke.cxx:73: error: 'RSA_size' was not declared in this scope /home/patrick/minisplat-20060619/libsplcrypto/source/openssl/pke.cxx: In member function 'void PublicKey::encrypt(byte_t*, size_t, byte_t*, size_t*)': /home/patrick/minisplat-20060619/libsplcrypto/source/openssl/pke.cxx:80: error: 'RSA_PKCS1_PADDING' was not declared in this scope /home/patrick/minisplat-20060619/libsplcrypto/source/openssl/pke.cxx:81: error: 'RSA_public_encrypt' was not declared in this scope make[2]: *** [libmcopenssl_la-pke.lo] Error 1 make[2]: Leaving directory `/home/patrick/minisplat-20060619/build/x86-pc-linux-gnu/libsplcrypto/source/openssl' make[1]: *** [all-recursive] Error 1 make[1]: Leaving directory `/home/patrick/minisplat-20060619/build/x86-pc-linux-gnu/libsplcrypto/source' make: *** [all-recursive] Error 1 system make failed: 512 at ./build.pl line 549.