/home/atul/bin/install-check -m 644 ./ifnames.1 /opt/gnome2/man/man1/ifnames.1 /usr/bin/install: cannot create regular file `/opt/gnome2/man/man1/ifnames.1': Permission denied /home/atul/bin/install-check -m 644 ./autoscan.1 /opt/gnome2/man/man1/autoscan.1 /usr/bin/install: cannot create regular file `/opt/gnome2/man/man1/autoscan.1': Permission denied /home/atul/bin/install-check -m 644 ./autom4te.1 /opt/gnome2/man/man1/autom4te.1 /usr/bin/install: cannot create regular file `/opt/gnome2/man/man1/autom4te.1': Permission denied /home/atul/bin/install-check -m 644 ./config.guess.1 /opt/gnome2/man/man1/config.guess.1 /usr/bin/install: cannot create regular file `/opt/gnome2/man/man1/config.guess.1': Permission denied /home/atul/bin/install-check -m 644 ./config.sub.1 /opt/gnome2/man/man1/config.sub.1 /usr/bin/install: cannot create regular file `/opt/gnome2/man/man1/config.sub.1': Permission denied make[2]: *** [install-man1] Error 1 make[2]: Leaving directory `/home/atul/cvs/gnome2/autoconf-2.59/man' make[1]: *** [install-am] Error 2 make[1]: Leaving directory `/home/atul/cvs/gnome2/autoconf-2.59/man' make: *** [install-recursive] Error 1 *** error during stage install of autoconf: Error running make install *** [2/10] [1] rerun stage install [2] ignore error and continue to done [3] give up on module [4] start shell