PREFIX=/home/akp/xscale/build-tools/buildroot/build_armeb/root utils install_utils make[1]: Entering directory `/home/akp/xscale/build-tools/buildroot/toolchain_build_armeb/uClibc' CC utils/readelf ../lib/libc.so.0: undefined reference to `__GI_rtime' collect2: ld returned 1 exit status make[2]: *** [../utils/readelf] Error 1 make[1]: *** [utils] Error 2 make[1]: Leaving directory `/home/akp/xscale/build-tools/buildroot/toolchain_build_armeb/uClibc' make: *** [/home/akp/xscale/build-tools/buildroot/build_armeb/root/usr/bin/ldd] Error 2