Making all in groupwise make[4]: Entering directory `/root/src/jhbuild-evo/evolution-data-server/camel/p roviders/groupwise' Makefile:504: *** missing separator (did you mean TAB instead of 8 spaces?). St op. make[4]: Leaving directory `/root/src/jhbuild-evo/evolution-data-server/camel/pr oviders/groupwise' make[3]: *** [all-recursive] Error 1 make[3]: Leaving directory `/root/src/jhbuild-evo/evolution-data-server/camel/pr oviders' make[2]: *** [all-recursive] Error 1 make[2]: Leaving directory `/root/src/jhbuild-evo/evolution-data-server/camel' make[1]: *** [all-recursive] Error 1 make[1]: Leaving directory `/root/src/jhbuild-evo/evolution-data-server' make: *** [all] Error 2 *** error during stage build of evolution-data-server: could not build module **