tanner@tanner-ubuntufast:~/SVN/bzworkbench/Debug$ make Building file: ../src/TextUtils.cxx Invoking: GCC C++ Compiler g++ -I/usr/include/ -O0 -g3 -Wall -c -fmessage-length=0 -MMD -MP -MF"src/TextUtils.d" -MT"src/TextUtils.d" -o"src/TextUtils.o" "../src/TextUtils.cxx" ../src/TextUtils.cxx:17:23: error: TextUtils.h: No such file or directory ../src/TextUtils.cxx:21:21: error: defines.h: No such file or directory ../src/TextUtils.cxx: In function ‘std::string TextUtils::no_whitespace(const std::string&)’: ../src/TextUtils.cxx:89: error: ‘isWhitespace’ was not declared in this scope ../src/TextUtils.cxx:96: error: ‘isWhitespace’ was not declared in this scope ../src/TextUtils.cxx: In function ‘std::string TextUtils::url_encode(const std::string&)’: ../src/TextUtils.cxx:254: error: ‘isAlphanumeric’ was not declared in this scope ../src/TextUtils.cxx:256: error: ‘isWhitespace’ was not declared in this scope ../src/TextUtils.cxx: In function ‘std::string TextUtils::escape(const std::string&, char)’: ../src/TextUtils.cxx:273: error: ‘isAlphanumeric’ was not declared in this scope ../src/TextUtils.cxx: At global scope: ../src/TextUtils.cxx:324: fatal error: opening dependency file src/TextUtils.d: No such file or directory compilation terminated. make: *** [src/TextUtils.o] Error 1