bfin-linux-uclibc-gcc -DHAVE_CONFIG_H -I. -I../../spandsp-0.0.4/src -I. -I.. -DEMBED -D__uClinux__ -I/DEVEL/embedded/blackfin-sources/uclinux-dist -mcpu=bf537-0.2 -DNDEBUG -O2 -g -std=gnu99 -ffast-math -Wall -Wunused-variable -Wwrite-strings -Wstrict-prototypes -Wmissing-prototypes -pipe -Wall -O2 -mfdpic -mcpu=bf537-0.2 -ffast-math -MT gsm0610_decode.lo -MD -MP -MF .deps/gsm0610_decode.Tpo -c ../../spandsp-0.0.4/src/gsm0610_decode.c -o gsm0610_decode.o ../../spandsp-0.0.4/src/gsm0610_decode.c: In function 'gsm0610_unpack_voip': ../../spandsp-0.0.4/src/gsm0610_decode.c:309: error: insn does not satisfy its constraints: (insn 379 137 380 1 ../../spandsp-0.0.4/src/gsm0610_decode.c:287 (set (reg:SI 17 I1) (plus:SI (reg:SI 17 I1) (const_int 2 [0x2]))) 62 {addsi3} (nil) (nil)) ../../spandsp-0.0.4/src/gsm0610_decode.c:309: internal compiler error: in reload_cse_simplify_operands, at postreload.c:393 Please submit a full bug report, with preprocessed source if appropriate. See for instructions. make[7]: *** [gsm0610_decode.lo] Error 1 make[6]: *** [all] Error 2 make[5]: *** [all-recursive] Error 1 make[4]: *** [build/.built] Error 2