"gossip-chatroom.c", line 710: identifier redeclared: gossip_chatroom_get_occupants current : function(pointer to struct _GossipChatroom {struct _GObject {..} parent}) returning enum {GOSSIP_CHATROOM_STATUS_UNKNOWN(4), GOSSIP_CHATROOM_STATUS_ERROR(3), GOSSIP_CHATROOM_STATUS_ACTIVE(2), GOSSIP_CHATROOM_STATUS_JOINING(1), GOSSIP_CHATROOM_STATUS_INACTIVE(0)} previous: function(pointer to struct _GossipChatroom {struct _GObject {..} parent}) returning unsigned int : "gossip-chatroom.h", line 142 cc: acomp failed for gossip-chatroom.c gmake[3]: *** [gossip-chatroom.lo] Error 1 gmake[3]: Leaving directory `/opt/PMp/network/gossip/work/gossip-0.27/libgossip' gmake[2]: *** [all] Error 2 gmake[2]: Leaving directory `/opt/PMp/network/gossip/work/gossip-0.27/libgossip' gmake[1]: *** [all-recursive] Error 1 gmake[1]: Leaving directory `/opt/PMp/network/gossip/work/gossip-0.27' gmake: *** [all] Error 2