g++ -DHAVE_CONFIG_H -I. -I../.. -I/usr/include/mysql -I/usr/local/include/mysql -I/usr/include/openssl -I/usr/local/include/openssl -I. -I./../../dep/include -I./../shared -I./../../dep/src/gm -I./../logonserver -I/usr/include/mysql -I/usr/local/include/mysql -I/usr/include/openssl -I/usr/local/include/openssl -MT Object.o -MD -MP -MF .deps/Object.Tpo -c -o Object.o Object.cpp Object.cpp: In destructor 'virtual Object::~Object()': Object.cpp:69: error: 'CStackWalker' was not declared in this scope Object.cpp:69: error: expected `;' before 'ws' Object.cpp:71: error: 'std::ws' does not have class type Object.cpp: In member function 'void Object::SpellNonMeleeDamageLog(Unit*, uint32, uint32, bool, bool)': Object.cpp:2042: warning: converting to 'int32' from 'float' Object.cpp:2043: warning: converting to 'int32' from 'float' make[3]: *** [Object.o] Error 1 make[3]: Leaving directory `/home/ascent/SVN/1340/src/game' make[2]: *** [all-recursive] Error 1 make[2]: Leaving directory `/home/ascent/SVN/1340/src' make[1]: *** [all-recursive] Error 1 make[1]: Leaving directory `/home/ascent/SVN/1340' make: *** [all] Error 2