-c -o extension/internal/gnome.o `test -f 'extension/internal/gnome.cpp' || echo './'`extension/internal/gnome.cpp; \ then mv -f "extension/internal/.deps/gnome.Tpo" "extension/internal/.deps/gnome.Po"; \ else rm -f "extension/internal/.deps/gnome.Tpo"; exit 1; \ fi extension/internal/gnome.cpp: In member function 'virtual unsigned int Inkscape::Extension::Internal::PrintGNOME::fill(Inkscape::Extension::Print*, const NRBPath*, const NRMatrix*, const SPStyle*, const NRRect*, const NRRect*, const NRRect*)': extension/internal/gnome.cpp:215: error: 'const struct SPIPaint' has no member named 'type' extension/internal/gnome.cpp:215: error: 'SP_PAINT_TYPE_COLOR' was not declared in this scope extension/internal/gnome.cpp:233: error: 'const struct SPIPaint' has no member named 'type' extension/internal/gnome.cpp:233: error: 'SP_PAINT_TYPE_PAINTSERVER' was not declared in this scope extension/internal/gnome.cpp: In member function 'virtual unsigned int Inkscape::Extension::Internal::PrintGNOME::stroke(Inkscape::Extension::Print*, const NRBPath*, const NRMatrix*, const SPStyle*, const NRRect*, const NRRect*, const NRRect*)': extension/internal/gnome.cpp:318: error: 'const struct SPIPaint' has no member named 'type' extension/internal/gnome.cpp:318: error: 'SP_PAINT_TYPE_COLOR' was not declared in this scope make[2]: *** [extension/internal/gnome.o] Error 1 make[2]: Leaving directory `/home/avp/soft/svn/inkscape/src' make[1]: *** [all-recursive] Error 1 make[1]: Leaving directory `/home/avp/soft/svn/inkscape'