main.c: In function 'main': main.c:104: error: 'x_pos' undeclared (first use in this function) main.c:104: error: (Each undeclared identifier is reported only once main.c:104: error: for each function it appears in.) main.c:105: error: 'width' undeclared (first use in this function) main.c:109: warning: value computed is not used main.c:128: error: 'y_pos' undeclared (first use in this function) main.c:128: error: 'height' undeclared (first use in this function) main.c:137: warning: implicit declaration of function 'sceDisplayWaitVblankStart' main.c:143: error: 'delete' undeclared (first use in this function) main.c:143: error: syntax error before ']' token main.c:67: warning: unused variable 'v0' make: *** [main.o] Error 1