[ 14%] Building CXX object shadercompiler/shadervm/CMakeFiles/shadervm.dir/shadervm.o In file included from /var/www/pulse-1.1.21/data/work/dev-aqsis.continuous/linux/aqsis/shadercompiler/shadervm/shadervm.cpp:38: /var/www/pulse-1.1.21/data/work/dev-aqsis.continuous/linux/build/version.h:42: error: missing terminating " character /var/www/pulse-1.1.21/data/work/dev-aqsis.continuous/linux/build/version.h:40: error: invalid function declaration /var/www/pulse-1.1.21/data/work/dev-aqsis.continuous/linux/aqsis/interfaces/isurface.h:113: error: 'IqBound' has not been declared make[2]: *** [shadercompiler/shadervm/CMakeFiles/shadervm.dir/shadervm.o] Error 1 make[1]: *** [shadercompiler/shadervm/CMakeFiles/shadervm.dir/all] Error 2 make: *** [all] Error 2