~/osm/sites/rails_port/db/functions more Makefile QTDIR=../../lib/quad_tile libquadtile.so: quadtile.o cc -shared -o libquadtile.so quadtile.o libquadtile.dylib: quadtile.o libtool -dynamic quadtile.o -o libquadtile.dylib libquadtile.o: quadtile.c ${QTDIR}/quad_tile.h cc `mysql_config --include` -I${QTDIR} -fPIC -O3 -c -o quadtile.o quadti le.c ~/osm/sites/rails_port/db/functions make libquadtile.dylib cc -c -o quadtile.o quadtile.c quadtile.c:1:23: error: my_global.h: No such file or directory quadtile.c:2:20: error: my_sys.h: No such file or directory quadtile.c:3:22: error: m_string.h: No such file or directory quadtile.c:4:19: error: mysql.h: No such file or directory quadtile.c:5:23: error: quad_tile.h: No such file or directory quadtile.c:7: error: parse error before "tile_for_point_init" quadtile.c:7: error: parse error before '*' token quadtile.c: In function 'tile_for_point_init': quadtile.c:9: error: 'args' undeclared (first use in this function) quadtile.c:9: error: (Each undeclared identifier is reported only once quadtile.c:9: error: for each function it appears in.) quadtile.c:10: error: 'INT_RESULT' undeclared (first use in this function) quadtile.c:13: warning: incompatible implicit declaration of built-in function 'strcpy' quadtile.c:13: error: 'message' undeclared (first use in this function) quadtile.c: At top level: quadtile.c:20: error: parse error before '*' token quadtile.c:25: error: parse error before '*' token quadtile.c: In function 'tile_for_point': quadtile.c:27: error: 'args' undeclared (first use in this function) make: *** [quadtile.o] Error 1 ~/osm/sites/rails_port/db/functions