In file included from e_includes.h:24, from e.h:122, from e_main.c:4: e_apps.h:83: error: syntax error before "Ecore_Exe_Event_Del" e_apps.h:83: warning: no semicolon at end of struct or union e_apps.h:85: error: syntax error before '*' token e_apps.h:85: error: 'read' redeclared as different kind of symbol /usr/include/unistd.h:312: error: previous declaration of 'read' was here e_apps.h:85: error: 'read' redeclared as different kind of symbol /usr/include/unistd.h:312: error: previous declaration of 'read' was here e_apps.h:85: warning: data definition has no type or storage class e_apps.h:86: error: syntax error before '}' token make[3]: *** [e_main.o] Error 1 make[3]: Leaving directory `/var/tmp/portage/e-9999/work/e17/apps/e/src/bin' make[2]: *** [all-recursive] Error 1 make[2]: Leaving directory `/var/tmp/portage/e-9999/work/e17/apps/e/src' make[1]: *** [all-recursive] Error 1 make[1]: Leaving directory `/var/tmp/portage/e-9999/work/e17/apps/e' make: *** [all] Error 2 * This is a LIVE CVS ebuild. * That means there are NO promises it will work. * If it fails to build, FIX THE CODE YOURSELF * before reporting any issues.