make[3]: Nothing to be done for `all'. make[3]: Leaving directory `/opt/trunk/sql/updates' make[3]: Entering directory `/opt/trunk/sql' make[3]: Nothing to be done for `all-am'. make[3]: Leaving directory `/opt/trunk/sql' make[2]: Leaving directory `/opt/trunk/sql' Making all in src make[2]: Entering directory `/opt/trunk/src' Making all in framework make[3]: Entering directory `/opt/trunk/src/framework' make[3]: Nothing to be done for `all'. make[3]: Leaving directory `/opt/trunk/src/framework' Making all in shared make[3]: Entering directory `/opt/trunk/src/shared' g++ -DHAVE_CONFIG_H -I. -I../.. -I../../src/shared -I. -I./../../dep/include -I./../framework -I./../shared -I./../../dep/include/g3dlite -DENABLE_RA -DENABLE_CLI -g -O2 -MT Database.o -MD -MP -MF .deps/Database.Tpo -c -o Database.o `test -f 'Database/Database.cpp' || echo './'`Database/Database.cpp In file included from Database/DatabaseEnv.h:37, from Database/Database.cpp:19: ./Database/QueryResultMysql.h:29:19: error: mysql.h: No such file or directory ./Database/QueryResultMysql.h:35: error: expected `)' before '*' token ./Database/QueryResultMysql.h:42: error: 'enum_field_types' has not been declared ./Database/QueryResultMysql.h:45: error: ISO C++ forbids declaration of 'MYSQL_RES' with no type ./Database/QueryResultMysql.h:45: error: expected ';' before '*' token ./Database/DatabaseMysql.h:69: error: ISO C++ forbids declaration of 'MYSQL' with no type ./Database/DatabaseMysql.h:69: error: expected ';' before '*' token ./Database/DatabaseMysql.h: In member function 'virtual DatabaseMysql::operator bool() const': ./Database/DatabaseMysql.h:55: error: 'mMysql' was not declared in this scope make[3]: *** [Database.o] Error 1 make[3]: Leaving directory `/opt/trunk/src/shared' make[2]: *** [all-recursive] Error 1 make[2]: Leaving directory `/opt/trunk/src' make[1]: *** [all-recursive] Error 1 make[1]: Leaving directory `/opt/trunk' make: *** [all] Error 2