make[3]: *** [kded_favicons.la] Error 1 make[3]: Leaving directory `/var/tmp/portage/kdebase-3.5.2-r2/work/kdebase-3.5.2/libkonq/favicons' make[2]: *** [all-recursive] Error 1 make[2]: Leaving directory `/var/tmp/portage/kdebase-3.5.2-r2/work/kdebase-3.5.2/libkonq' make[1]: *** [all-recursive] Error 1 make[1]: Leaving directory `/var/tmp/portage/kdebase-3.5.2-r2/work/kdebase-3.5.2' make: *** [all] Error 2 !!! ERROR: kde-base/kdebase-3.5.2-r2 failed. Call stack: ebuild.sh, line 1539: Called dyn_compile ebuild.sh, line 939: Called src_compile kdebase-3.5.2-r2.ebuild, line 128: Called kde_src_compile kde.eclass, line 164: Called kde_src_compile 'all' kde.eclass, line 299: Called kde_src_compile 'myconf' 'configure' 'make' kde.eclass, line 295: Called die !!! died running emake, kde_src_compile:make !!! If you need support, post the topmost build error, and the call stack if relevant.