vs9208:/opt/trunk# vs9208:/opt/trunk# vs9208:/opt/trunk# vs9208:/opt/trunk# ./Database/QueryResultMysql.h:29:19: error: mysql.h: No such file or directory -bash: ./Database/QueryResultMysql.h:29:19:: No such file or directory vs9208:/opt/trunk# ./Database/QueryResultMysql.h:35: error: expected `)' before '*' token > ./Database/QueryResultMysql.h:42: error: 'enum_field_types' has not been declared > ./Database/QueryResultMysql.h:45: error: ISO C++ forbids declaration of 'MYSQL_RES' with no type > ./Database/QueryResultMysql.h:45: error: expected ';' before '*' token > ./Database/DatabaseMysql.h:69: error: ISO C++ forbids declaration of 'MYSQL' with no type > ./Database/DatabaseMysql.h:69: error: expected ';' before '*' token > ./Database/DatabaseMysql.h: In member function 'virtual DatabaseMysql::operator bool() const': > ./Database/DatabaseMysql.h:55: error: 'mMysql' was not declared in this scope > make[3]: *** [Database.o] Error 1 > make[3]: Leaving directory `/opt/trunk/src/shared' > make[2]: *** [all-recursive] Error 1 > make[2]: Leaving directory `/opt/trunk/src' > make[1]: *** [all-recursive] Error 1 > make[1]: Leaving directory `/opt/trunk' -bash: command substitution: line 1: syntax error near unexpected token `)' -bash: command substitution: line 1: `)' before '*' token' -bash: bad substitution: no closing "`" in `/opt/trunk' vs9208:/opt/trunk# make: *** [all] Error 2