-O2 -Wall -Wno-pointer-sign -funsigned-char -MT gyachi-mcrypt.o -MD -MP -MF .deps/gyachi-mcrypt.Tpo -c -o gyachi-mcrypt.o gyachi-mcrypt.c gyachi-mcrypt.c:29:20: error: mcrypt.h: No such file or directory gyachi-mcrypt.c: In function ‘decrypt_message’: gyachi-mcrypt.c:150: error: ‘MCRYPT’ undeclared (first use in this function) gyachi-mcrypt.c:150: error: (Each undeclared identifier is reported only once gyachi-mcrypt.c:150: error: for each function it appears in.) gyachi-mcrypt.c:150: error: expected ‘;’ before ‘td’ gyachi-mcrypt.c:203: error: ‘td’ undeclared (first use in this function) gyachi-mcrypt.c:203: warning: implicit declaration of function ‘mcrypt_module_open’ gyachi-mcrypt.c:205: error: ‘MCRYPT_FAILED’ undeclared (first use in this function) gyachi-mcrypt.c:210: warning: implicit declaration of function ‘mcrypt_enc_get_iv_size’ gyachi-mcrypt.c:242: warning: implicit declaration of function ‘mcrypt_generic_init’ gyachi-mcrypt.c:256: warning: implicit declaration of function ‘mdecrypt_generic’ gyachi-mcrypt.c:262: warning: implicit declaration of function ‘mcrypt_generic_end’ gyachi-mcrypt.c: In function ‘encrypt_message’: gyachi-mcrypt.c:271: error: ‘MCRYPT’ undeclared (first use in this function) gyachi-mcrypt.c:271: error: expected ‘;’ before ‘td’ gyachi-mcrypt.c:322: error: ‘td’ undeclared (first use in this function) gyachi-mcrypt.c:325: warning: implicit declaration of function ‘mcrypt_enc_get_key_size’ gyachi-mcrypt.c:327: error: ‘MCRYPT_FAILED’ undeclared (first use in this function) gyachi-mcrypt.c:380: warning: implicit declaration of function ‘mcrypt_generic’ make[2]: *** [gyachi-mcrypt.o] Error 1 make[2]: Leaving directory `/home/mark-i/gyachi/plugins' make[1]: *** [all-recursive] Error 1 make[1]: Leaving directory `/home/mark-i/gyachi' make: *** [all] Error 2 [mark-i@localhost gyachi]$