scons: Reading SConscript files ... Checking for g++ >= 3.4...(cached) yes Checking for pkg-config... (cached) yes Checking for gtk+-2.0 >= 2.6... (cached) yes Checking for gthread-2.0 >= 2.4... (cached) yes Checking for libglade-2.0 >= 2.4... (cached) yes Checking for C header file time.h... (cached) yes Checking for C header file signal.h... (cached) yes Checking for C header file unistd.h... (cached) yes Checking for C header file sys/poll.h... (cached) yes Checking for main() in C library pthread... (cached) yes Checking for main() in C library z... (cached) yes Checking for main() in C library bz2... (cached) yes Checking for PTHREAD_RECURSIVE_MUTEX_INITIALIZER_NP in pthread.h... (cached) yes scons: done reading SConscript files. scons: Building targets ... gcc -o build/gui/eggtrayicon.o -c -DXTHREADS -pthread -pthread -I/usr/include/libglade-2.0 -I/usr/include/gtk-2.0 -I/usr/include/libxml2 -I/usr/lib/gtk-2.0/include -I/usr/include/atk-1.0 -I/usr/include/cairo -I/usr/include/pango-1.0 -I/usr/X11R6/include -I/usr/include/glib-2.0 -I/usr/lib/glib-2.0/include linux/eggtrayicon.c linux/eggtrayicon.c:21:19: error: config.: Filen eller katalogen finns inte linux/eggtrayicon.c: In function 'egg_tray_icon_class_init': linux/eggtrayicon.c:127: error: 'GETTEXT_PACKAGE' undeclared (first use in this function) linux/eggtrayicon.c:127: error: (Each undeclared identifier is reported only once linux/eggtrayicon.c:127: error: for each function it appears in.) scons: *** [build/gui/eggtrayicon.o] Error 1 scons: building terminated because of errors.