creating evolve_decc make[3]: Leaving directory `/home/ruskie/e17_cvs/e17/libs/evolve/src/bin' make[3]: Entering directory `/home/ruskie/e17_cvs/e17/libs/evolve/src' make[3]: Leaving directory `/home/ruskie/e17_cvs/e17/libs/evolve/src' make[2]: Leaving directory `/home/ruskie/e17_cvs/e17/libs/evolve/src' make[1]: Leaving directory `/home/ruskie/e17_cvs/e17/libs/evolve/src' Making all in data make[1]: Entering directory `/home/ruskie/e17_cvs/e17/libs/evolve/data' Making all in interfaces make[2]: Entering directory `/home/ruskie/e17_cvs/e17/libs/evolve/data/interfaces' Making all in etk_test make[3]: Entering directory `/home/ruskie/e17_cvs/e17/libs/evolve/data/interfaces/etk_test' ../../../src/bin/evolve_cc \ -DETK_DEFAULT_THEME=/opt/e17/share/etk/themes/default.edj \ ../../../data/interfaces/etk_test/etk_test.etk \ ../../../data/interfaces/etk_test/etk_test.eet line-map.c: file "edje.etk" left but not entered make[3]: *** [etk_test.eet] Segmentation fault (core dumped) make[3]: *** Deleting file `etk_test.eet' make[3]: Leaving directory `/home/ruskie/e17_cvs/e17/libs/evolve/data/interfaces/etk_test' make[2]: *** [all-recursive] Error 1 make[2]: Leaving directory `/home/ruskie/e17_cvs/e17/libs/evolve/data/interfaces' make[1]: *** [all-recursive] Error 1 make[1]: Leaving directory `/home/ruskie/e17_cvs/e17/libs/evolve/data' make: *** [all-recursive] Error 1