There were 3 errors:
1) testPropPatchSetLiveProperty(ezcWebdavFileBackendTest)
ezcBasePropertyNotFoundException: No such property name 'mime'.
/home/derick/dev/ezcomponents/trunk/Webdav/src/transports/property_handler.php:507
/home/derick/dev/ezcomponents/trunk/Webdav/src/transports/property_handler.php:357
/home/derick/dev/ezcomponents/trunk/Webdav/src/backends/file.php:408
/home/derick/dev/ezcomponents/trunk/Webdav/src/backends/file.php:479
/home/derick/dev/ezcomponents/trunk/Webdav/src/backends/simple.php:631
/home/derick/dev/ezcomponents/trunk/Webdav/src/backends/file.php:937
2) testPropPatchFailOnRemoveProperty(ezcWebdavFileBackendTest)
ezcBasePropertyNotFoundException: No such property name 'mime'.
/home/derick/dev/ezcomponents/trunk/Webdav/src/transports/property_handler.php:507
/home/derick/dev/ezcomponents/trunk/Webdav/src/transports/property_handler.php:357
/home/derick/dev/ezcomponents/trunk/Webdav/src/backends/file.php:408
/home/derick/dev/ezcomponents/trunk/Webdav/src/backends/file.php:479
/home/derick/dev/ezcomponents/trunk/Webdav/src/backends/simple.php:631
/home/derick/dev/ezcomponents/trunk/Webdav/src/backends/file.php:937
3) testPropPatchCombinedSetDeleteFail(ezcWebdavFileBackendTest)
ezcBasePropertyNotFoundException: No such property name 'mime'.
/home/derick/dev/ezcomponents/trunk/Webdav/src/transports/property_handler.php:507
/home/derick/dev/ezcomponents/trunk/Webdav/src/transports/property_handler.php:357
/home/derick/dev/ezcomponents/trunk/Webdav/src/backends/file.php:408
/home/derick/dev/ezcomponents/trunk/Webdav/src/backends/file.php:479
/home/derick/dev/ezcomponents/trunk/Webdav/src/backends/simple.php:631
/home/derick/dev/ezcomponents/trunk/Webdav/src/backends/file.php:937
--
There were 2 failures:
1) propfind_allprop(ezcWebdavClientRfcTest)
Response sent by WebDAV server incorrect.
Failed asserting that two arrays are equal.
--- Expected
+++ Actual
@@ -26,24 +26,6 @@
Hadrian
-
-
-
-
-
-
-
-
-
-
-
-
-
-
-
-
-
-
HTTP/1.1 200 OK
@@ -63,24 +45,6 @@
Box type B
-
-
-
-
-
-
-
-
-
-
-
-
-
-
-
-
-
-
HTTP/1.1 200 OK
2) propfind_propname(ezcWebdavClientRfcTest)
Response sent by WebDAV server incorrect.
Failed asserting that two arrays are equal.
--- Expected
+++ Actual
@@ -20,7 +20,6 @@
-
@@ -39,7 +38,6 @@
-
HTTP/1.1 200 OK
FAILURES!
Tests: 1183, Failures: 2, Errors: 3.
Aborted: TESTS FAILED