[ 87%] Building CXX object apps/konsole/src/CMakeFiles/kdeinit_konsole.dir/XKB.o /Users/orville/Desktop/KDE/kdebase/apps/konsole/src/XKB.cpp:32:30: error: QtGui/QX11Info: No such file or directory /Users/orville/Desktop/KDE/kdebase/apps/konsole/src/XKB.cpp: In function ‘int xkb_init()’: /Users/orville/Desktop/KDE/kdebase/apps/konsole/src/XKB.cpp:50: error: ‘QX11Info’ has not been declared /Users/orville/Desktop/KDE/kdebase/apps/konsole/src/XKB.cpp:50: error: ‘display’ was not declared in this scope /Users/orville/Desktop/KDE/kdebase/apps/konsole/src/XKB.cpp: In function ‘unsigned int xkb_scrolllock_mask()’: /Users/orville/Desktop/KDE/kdebase/apps/konsole/src/XKB.cpp:97: error: ‘QX11Info’ has not been declared /Users/orville/Desktop/KDE/kdebase/apps/konsole/src/XKB.cpp:97: error: ‘display’ was not declared in this scope /Users/orville/Desktop/KDE/kdebase/apps/konsole/src/XKB.cpp:98: error: ‘QX11Info’ has not been declared /Users/orville/Desktop/KDE/kdebase/apps/konsole/src/XKB.cpp: In function ‘int xkb_set_on()’: /Users/orville/Desktop/KDE/kdebase/apps/konsole/src/XKB.cpp:129: error: ‘QX11Info’ has not been declared /Users/orville/Desktop/KDE/kdebase/apps/konsole/src/XKB.cpp:129: error: ‘display’ was not declared in this scope /Users/orville/Desktop/KDE/kdebase/apps/konsole/src/XKB.cpp: In function ‘int xkb_set_off()’: /Users/orville/Desktop/KDE/kdebase/apps/konsole/src/XKB.cpp:143: error: ‘QX11Info’ has not been declared /Users/orville/Desktop/KDE/kdebase/apps/konsole/src/XKB.cpp:143: error: ‘display’ was not declared in this scope make[2]: *** [apps/konsole/src/CMakeFiles/kdeinit_konsole.dir/XKB.o] Error 1 make[1]: *** [apps/konsole/src/CMakeFiles/kdeinit_konsole.dir/all] Error 2 make: *** [all] Error 2 The-Cube:kdebase.build orville$