onjour.c:121: error: expected ';' before 'gaim_account_get_username' bonjour.c:122: error: 'BonjourDnsSd' has no member named 'txtvers' bonjour.c:123: error: 'BonjourDnsSd' has no member named 'version' bonjour.c:124: error: 'BonjourDnsSd' has no member named 'first' bonjour.c:125: error: 'BonjourDnsSd' has no member named 'last' bonjour.c:126: error: 'BonjourDnsSd' has no member named 'port_p2pj' bonjour.c:127: error: 'BonjourDnsSd' has no member named 'phsh' bonjour.c:128: error: 'BonjourDnsSd' has no member named 'email' bonjour.c:129: error: 'BonjourDnsSd' has no member named 'vc' bonjour.c:130: error: 'BonjourDnsSd' has no member named 'jid' bonjour.c:131: error: 'BonjourDnsSd' has no member named 'AIM' bonjour.c:136: error: 'BonjourDnsSd' has no member named 'status' bonjour.c:138: error: 'BonjourDnsSd' has no member named 'status' bonjour.c:140: error: 'BonjourDnsSd' has no member named 'status' bonjour.c:141: error: 'BonjourDnsSd' has no member named 'msg' bonjour.c:143: error: 'BonjourDnsSd' has no member named 'account' make[4]: *** [bonjour.lo] Error 1 make[4]: Leaving directory `/var/tmp/portage/gaim-2.0.0_beta3-r1/work/gaim-2.0.0beta3/src/protocols/bonjour' make[3]: *** [all-recursive] Error 1 make[3]: Leaving directory `/var/tmp/portage/gaim-2.0.0_beta3-r1/work/gaim-2.0.0beta3/src/protocols' make[2]: *** [all-recursive] Error 1 make[2]: Leaving directory `/var/tmp/portage/gaim-2.0.0_beta3-r1/work/gaim-2.0.0beta3/src' make[1]: *** [all-recursive] Error 1 make[1]: Leaving directory `/var/tmp/portage/gaim-2.0.0_beta3-r1/work/gaim-2.0.0beta3' make: *** [all] Error 2 !!! ERROR: net-im/gaim-2.0.0_beta3-r1 failed. Call stack: ebuild.sh, line 1545: Called dyn_compile ebuild.sh, line 940: Called src_compile gaim-2.0.0_beta3-r1.ebuild, line 202: Called die !!! Make failed !!! If you need support, post the topmost build error, and the call stack if relevant. !!! This ebuild is from an overlay: '/usr/local/portage'