charon:/home/jake/sync/gnokii/gnokii-0.6.13/patches/kernel_2.6# make make[1]: Entering directory `/usr/src/linux-2.6.15.3' CC [M] /home/jake/sync/gnokii/gnokii-0.6.13/patches/kernel_2.6/nokia_dku2.o /home/jake/sync/gnokii/gnokii-0.6.13/patches/kernel_2.6/nokia_dku2.c:56: error: expected ')' before numeric constant /home/jake/sync/gnokii/gnokii-0.6.13/patches/kernel_2.6/nokia_dku2.c:57: error: expected ')' before numeric constant /home/jake/sync/gnokii/gnokii-0.6.13/patches/kernel_2.6/nokia_dku2.c:58: error: expected ')' before numeric constant /home/jake/sync/gnokii/gnokii-0.6.13/patches/kernel_2.6/nokia_dku2.c:62: error: expected ')' before numeric constant make[2]: *** [/home/jake/sync/gnokii/gnokii-0.6.13/patches/kernel_2.6/nokia_dku2.o] Error 1 make[1]: *** [_module_/home/jake/sync/gnokii/gnokii-0.6.13/patches/kernel_2.6] Error 2 make[1]: Leaving directory `/usr/src/linux-2.6.15.3' make: *** [module] Error 2 charon:/home/jake/sync/gnokii/gnokii-0.6.13/patches/kernel_2.6# gcc --version gcc (GCC) 4.1.2 20060613 (prerelease) (Debian 4.1.1-5)