Building CXX object workspace/plasma/applets/digital-clock/CMakeFiles/plasma_applet_dig_clock.dir/clock.o c++: Internal error: Killed (program cc1plus) Please submit a full bug report. See for instructions. make[2]: *** [workspace/plasma/applets/digital-clock/CMakeFiles/plasma_applet_dig_clock.dir/clock.o] Error 1 make[1]: *** [workspace/plasma/applets/digital-clock/CMakeFiles/plasma_applet_dig_clock.dir/all] Error 2 make: *** [all] Error 2