make[3]: Leaving directory `/home/admin/slug-3.10/releases/slugos-3.10-beta/openslug-nslu2.tmp/work/asterisk-addons-1.4.4-r1/asterisk-addons-1.4.4/menuselect/mxml' gcc -Wall -o menuselect.o -g -c -D_GNU_SOURCE menuselect.c gcc -Wall -o menuselect_curses.o -g -c -D_GNU_SOURCE -I/home/admin/slug-3.10/releases/slugos-3.10-beta/openslug-nslu2.tmp/staging/armeb-linux/include menuselect_curses.cgcc -Wall -o strcompat.o -g -c -D_GNU_SOURCE strcompat.c gcc -g -Wall -o menuselect menuselect.o menuselect_curses.o strcompat.o mxml/libmxml.a -L/home/admin/slug-3.10/releases/slugos-3.10-beta/openslug-nslu2.tmp/staging/armeb-linux/lib -lncurses /usr/bin/ld: skipping incompatible /home/admin/slug-3.10/releases/slugos-3.10-beta/openslug-nslu2.tmp/staging/armeb-linux/lib/libncurses.so when searching for -lncurses /usr/bin/ld: skipping incompatible /home/admin/slug-3.10/releases/slugos-3.10-beta/openslug-nslu2.tmp/staging/armeb-linux/lib/libncurses.a when searching for -lncurses /usr/bin/ld: cannot find -lncurses collect2: ld returned 1 exit status make[2]: *** [menuselect] Error 1 make[2]: Leaving directory `/home/admin/slug-3.10/releases/slugos-3.10-beta/openslug-nslu2.tmp/work/asterisk-addons-1.4.4-r1/asterisk-addons-1.4.4/menuselect' make[1]: *** [all] Error 2 make[1]: Leaving directory `/home/admin/slug-3.10/releases/slugos-3.10-beta/openslug-nslu2.tmp/work/asterisk-addons-1.4.4-r1/asterisk-addons-1.4.4/menuselect' make: *** [menuselect/menuselect] Error 2 FATAL: oe_runmake failed