------ Rebuild All started: Project: mod_pony, Configuration: Debug Win32 ------ Deleting intermediate files and output files for project 'mod_pony', configuration 'Debug|Win32'. Compiling... mod_pony.c mod_pony.c(14) : warning C4013: 'newXS' undefined; assuming extern returning int mod_pony.c(33) : warning C4013: 'eval_pv' undefined; assuming extern returning int mod_pony.c(34) : warning C4013: 'get_sv' undefined; assuming extern returning int mod_pony.c(34) : error C2223: left of '->sv_flags' must point to struct/union mod_pony.c(34) : error C2223: left of '->sv_any' must point to struct/union mod_pony.c(34) : warning C4013: 'sv_2iv' undefined; assuming extern returning int mod_pony.c(34) : fatal error C1903: unable to recover from previous error(s); stopping compilation Build log was saved at "file://c:\src\pony_test\Debug\BuildLog.htm" mod_pony - 3 error(s), 4 warning(s) ---------------------- Done ---------------------- Rebuild All: 0 succeeded, 1 failed, 0 skipped