/usr/src/modules/nvidia-kernel/nv/os-interface.c:26: include/asm/io.h: In function `check_signature': include/asm/io.h:258: warning: wrong type argument to increment In file included from /usr/src/modules/nvidia-kernel/nv/os-interface.c:26: /usr/src/modules/nvidia-kernel/nv/nv-linux.h:241:5: warning: "NV_ENABLE_MEM_TRACKING" is not defined /usr/src/modules/nvidia-kernel/nv/nv-linux.h:269:5: warning: "NV_ENABLE_MEM_TRACKING" is not defined /usr/src/modules/nvidia-kernel/nv/nv-linux.h:691:2: warning: #warning "conftest.sh failed, assuming remap_page_range(4)!" /usr/src/modules/nvidia-kernel/nv/os-interface.c:667:5: warning: "DEBUG" is not defined /usr/src/modules/nvidia-kernel/nv/os-interface.c:679:5: warning: "DEBUG" is not defined /usr/src/modules/nvidia-kernel/nv/os-interface.c: In function 'os_set_mlock_capability':src/modules/nvidia-kernel/nv/os-interface.c:679:5: /usr/src/modules/nvidia-kernel/nv/os-interface.c:1262: error: structure has no member named `rlim' make[4]: *** [/usr/src/modules/nvidia-kernel/nv/os-interface.o] Error 1 make[3]: *** [_module_/usr/src/modules/nvidia-kernel/nv] Error 2 make[3]: Leaving directory `/usr/src/linux-headers-2.6.16-2-686' NVIDIA: left KBUILD. nvidia.ko failed to build! make[2]: *** [module] Error 1 make[2]: Leaving directory `/usr/src/modules/nvidia-kernel/nv' make[1]: *** [build-stamp] Error 2 make[1]: Leaving directory `/usr/src/modules/nvidia-kernel' make: *** [kdist_image] Error 2