make[2]: Entering directory `/home/kde-devel/kde/build/KDE/kdepimlibs' make[2]: *** No rule to make target `/usr/lib/libgpg-error.so', needed by `lib/libgpgme++-pth.so.1.0.0'. Stop. make[2]: Leaving directory `/home/kde-devel/kde/build/KDE/kdepimlibs' make[1]: *** [gpgme++/CMakeFiles/gpgmepp-pth.dir/all] Error 2 make[1]: *** Waiting for unfinished jobs.... make[2]: Entering directory `/home/kde-devel/kde/build/KDE/kdepimlibs' make[2]: *** No rule to make target `/usr/lib/libgpg-error.so', needed by `lib/libgpgme++.so.1.0.0'. Stop. make[2]: Leaving directory `/home/kde-devel/kde/build/KDE/kdepimlibs' make[1]: *** [gpgme++/CMakeFiles/gpgmepp.dir/all] Error 2 make[1]: Leaving directory `/home/kde-devel/kde/build/KDE/kdepimlibs' make: *** [all] Error 2 makeobj[0]: Leaving directory `/home/kde-devel/kde/build/KDE/kdepimlibs'