root@tsl7:/home/dikme/asterisk/pwlib_Mimas_patch2# make make P_SHAREDLIB=1 opt make[1]: Entering directory `/home/dikme/asterisk/pwlib_Mimas_patch2' set -e; make -C src/ptlib/unix opt; make[2]: Entering directory `/home/dikme/asterisk/pwlib_Mimas_patch2/src/ptlib/unix' g++ -D_REENTRANT -Wall -fPIC -I/home/dikme/asterisk/pwlib_Mimas_patch2/include -Os -felide-constructors -x c++ -c ../../ptclib/asner.cxx -o /home/dikme/asterisk/pwlib_Mimas_patch2/lib/obj_linux_x86_r/asner.o ../../ptclib/asner.cxx: In member function βPString PASN_Choice::GetTagName() constβ: ../../ptclib/asner.cxx:2112: error: βpsprintfβ was not declared in this scope make[2]: *** [/home/dikme/asterisk/pwlib_Mimas_patch2/lib/obj_linux_x86_r/asner.o] Error 1 make[2]: Leaving directory `/home/dikme/asterisk/pwlib_Mimas_patch2/src/ptlib/unix' make[1]: *** [opt] Error 2 make[1]: Leaving directory `/home/dikme/asterisk/pwlib_Mimas_patch2' make: *** [optshared] Error 2