[ 71%] Building CXX object workspace/plasma/dataengines/filebrowser/CMakeFiles/plasma_engine_filebrowser.dir/filebrowserengine.o /home/az/src/kde/kdebase/workspace/plasma/dataengines/filebrowser/filebrowserengine.cpp: In member function `void FileBrowserEngine::updateData(const QString&, FileBrowserEngine::EventType)': /home/az/src/kde/kdebase/workspace/plasma/dataengines/filebrowser/filebrowserengine.cpp:113: error: syntax error before `:' token /home/az/src/kde/kdebase/workspace/plasma/dataengines/filebrowser/filebrowserengine.cpp:114: error: syntax error before `:' token /home/az/src/kde/kdebase/workspace/plasma/dataengines/filebrowser/filebrowserengine.cpp:115: error: syntax error before `:' token /home/az/src/kde/kdebase/workspace/plasma/dataengines/filebrowser/filebrowserengine.cpp:116: error: syntax error before `:' token make[2]: *** [workspace/plasma/dataengines/filebrowser/CMakeFiles/plasma_engine_filebrowser.dir/filebrowserengine.o] Fehler 1 make[2]: Das Target »workspace/plasma/dataengines/filebrowser/CMakeFiles/plasma_engine_filebrowser.dir/build« wurde wegen Fehlern nicht aktualisiert. make[1]: *** [workspace/plasma/dataengines/filebrowser/CMakeFiles/plasma_engine_filebrowser.dir/all] Fehler 2 113 it.value()->setData("directories.visible", InvalidIfEmpty(visibleDirectories)); 114 it.value()->setData("directories.all", InvalidIfEmpty(allDirectories)); 115 it.value()->setData("files.visible", InvalidIfEmpty(visibleFiles)); 116 it.value()->setData("files.all", InvalidIfEmpty(allFiles));