make[1]: Entering directory `/home/waky/Downloads/urth-0.1-2-src/libs/ghf-0.8-0/libs/libelf-0.8.9/lib' if test -n ""; then \ gcc -c -DHAVE_CONFIG_H -I.. -I. -I. -O2 -m32 begin.c && mv -f begin.o begin.os; \ else true; fi gcc -c -DHAVE_CONFIG_H -I.. -I. -I. -O2 -m32 begin.c In file included from /usr/include/features.h:345, from /usr/include/stdint.h:26, from ./private.h:36, from begin.c:20: /usr/include/gnu/stubs.h:7:27: error: gnu/stubs-32.h: No such file or directory make[1]: *** [begin.o] Error 1 make[1]: Leaving directory `/home/waky/Downloads/urth-0.1-2-src/libs/ghf-0.8-0/libs/libelf-0.8.9/lib' make: *** [install-recursive] Error 1 scons: *** [/home/waky/Downloads/urth-0.1-2-src/libs/local/lib/libelf.a] Error 2 scons: building terminated because of errors. scons: *** ['ghf-0.8-0/build/libghf.a'] Error 2 scons: building terminated because of errors.