/Volumes/INTERNE 500/Developpement/Iphone/PrefsKit$ make /usr/local/arm-apple-darwin/bin/gcc -c -fsigned-char -I/usr/local/arm-apple-darwin/include/ -I/usr/local/arm-apple-darwin/include/UIKit/ -O3 Start.m -o Start.o /usr/local/arm-apple-darwin/bin/gcc -c -fsigned-char -I/usr/local/arm-apple-darwin/include/ -I/usr/local/arm-apple-darwin/include/UIKit/ -O3 MainView.m -o MainView.o In file included from /usr/local/lib/gcc/arm-apple-darwin/4.0.1/../../../../arm-apple-darwin/include/UIKit/UITable.h:7, from MainView.h:9, from MainView.m:9: /usr/local/lib/gcc/arm-apple-darwin/4.0.1/../../../../arm-apple-darwin/include/UIKit/UIScroller.h:78: error: syntax error before 'CDAnonymousStruct6' /usr/local/lib/gcc/arm-apple-darwin/4.0.1/../../../../arm-apple-darwin/include/UIKit/UIScroller.h:89: error: syntax error before 'CDAnonymousStruct6' /usr/local/lib/gcc/arm-apple-darwin/4.0.1/../../../../arm-apple-darwin/include/UIKit/UIScroller.h:97: error: syntax error before 'CDAnonymousStruct6' /usr/local/lib/gcc/arm-apple-darwin/4.0.1/../../../../arm-apple-darwin/include/UIKit/UIScroller.h:98: fatal error: method definition not in @implementation context compilation terminated. make: *** [MainView.o] Error 1