vasy Module # make && make install make[1]: Entering directory `/usr/src/linux-2.6.23-gentoo-r3' CC [M] /home/vasy/Drivers/rt61-cvs-2007121505/Module/rtmp_main.o /home/vasy/Drivers/rt61-cvs-2007121505/Module/rtmp_main.c: In function 'rt61_pci_probe': /home/vasy/Drivers/rt61-cvs-2007121505/Module/rtmp_main.c:825: error: 'struct net_device' has no member named 'wireless_handlers' make[2]: *** [/home/vasy/Drivers/rt61-cvs-2007121505/Module/rtmp_main.o] Error 1 make[1]: *** [_module_/home/vasy/Drivers/rt61-cvs-2007121505/Module] Error 2 make[1]: Leaving directory `/usr/src/linux-2.6.23-gentoo-r3' rt61.ko failed to build! make: *** [module] Error 1 vasy Module #