bash-3.1# make make all-recursive make[1]: Entering directory `/home/eclipse75/downloads/fragroute-1.2' Making all in scripts make[2]: Entering directory `/home/eclipse75/downloads/fragroute-1.2/scripts' make[2]: Nothing to be done for `all'. make[2]: Leaving directory `/home/eclipse75/downloads/fragroute-1.2/scripts' Making all in win32 make[2]: Entering directory `/home/eclipse75/downloads/fragroute-1.2/win32' make[2]: Nothing to be done for `all'. make[2]: Leaving directory `/home/eclipse75/downloads/fragroute-1.2/win32' make[2]: Entering directory `/home/eclipse75/downloads/fragroute-1.2' gcc -DHAVE_CONFIG_H -I. -I. -I. -I/usr/local/include -I/usr/local/include -g -O2 -Wall -c tun-loop.c tun-loop.c:34: error: redefinition of `struct tun' make[2]: *** [tun-loop.o] Error 1 make[2]: Leaving directory `/home/eclipse75/downloads/fragroute-1.2' make[1]: *** [all-recursive] Error 1 make[1]: Leaving directory `/home/eclipse75/downloads/fragroute-1.2' make: *** [all-recursive-am] Error 2 bash-3.1#