[ 83%] Building CXX object workspace/kdm/kfrontend/CMakeFiles/kdm_greet.dir/themer/kdmitem.o /var/tmp/portage/kde-base/kdebase-9999.4/work/kdebase-9999.4/workspace/kdm/kfrontend/themer/kdmitem.cpp: In member function 'void KdmItem::showStructure(const QString&)': /var/tmp/portage/kde-base/kdebase-9999.4/work/kdebase-9999.4/workspace/kdm/kfrontend/themer/kdmitem.cpp:600: error: expected primary-expression before 'if' /var/tmp/portage/kde-base/kdebase-9999.4/work/kdebase-9999.4/workspace/kdm/kfrontend/themer/kdmitem.cpp:600: error: expected ',' or ';' before 'if' /var/tmp/portage/kde-base/kdebase-9999.4/work/kdebase-9999.4/workspace/kdm/kfrontend/themer/kdmitem.cpp:600: error: expected primary-expression before 'else' /var/tmp/portage/kde-base/kdebase-9999.4/work/kdebase-9999.4/workspace/kdm/kfrontend/themer/kdmitem.cpp:600: error: expected `;' before 'else' make[2]: *** [workspace/kdm/kfrontend/CMakeFiles/kdm_greet.dir/themer/kdmitem.o] Error 1 make[2]: *** Waiting for unfinished jobs....