cups-util.c:454: warning: passing argument 1 of 'httpAddrLocalhost' from incompatible pointer type make[4]: *** [cups-util.lo] Error 1 make[4]: *** Waiting for unfinished jobs.... make[3]: *** [all-recursive] Error 1 make[2]: *** [all-recursive] Error 1 make[1]: *** [all-recursive] Error 1 make: *** [all] Error 2 * * ERROR: kde-base/kdelibs-3.5.7 failed. * Call stack: * ebuild.sh, line 46: Called src_compile * environment, line 4162: Called kde_src_compile * environment, line 2823: Called kde_src_compile 'src_compile' * environment, line 2944: Called kde_src_compile 'src_compile' 'all' 'myconf' * environment, line 2940: Called die * The specific snippet of code: * emake || diefunc "$FUNCNAME" "$LINENO" "$?" "died running emake, $FUNCNAME:make" * The die message: * died running emake, kde_src_compile:make