panel-applet-frame.c: In function 'panel_applet_frame_set_flags_from_any': panel-applet-frame.c:188: error: expected expression before 'do' make[3]: *** [panel-applet-frame.o] Error 1 make[3]: *** Waiting for unfinished jobs.... make[3]: Leaving directory `/var/tmp/portage/gnome-base/gnome-panel-2.20.1/work/gnome-panel-2.20.1/gnome-panel' make[2]: *** [all] Error 2 make[2]: Leaving directory `/var/tmp/portage/gnome-base/gnome-panel-2.20.1/work/gnome-panel-2.20.1/gnome-panel' make[1]: *** [all-recursive] Error 1 make[1]: Leaving directory `/var/tmp/portage/gnome-base/gnome-panel-2.20.1/work/gnome-panel-2.20.1' make: *** [all] Error 2 * * ERROR: gnome-base/gnome-panel-2.20.1 failed. * Call stack: * ebuild.sh, line 1701: Called dyn_compile * ebuild.sh, line 1039: Called qa_call 'src_compile' * ebuild.sh, line 44: Called src_compile * ebuild.sh, line 1383: Called gnome2_src_compile * gnome2.eclass, line 71: Called die * The specific snippet of code: * emake || die "compile failure" * The die message: * compile failure * * If you need support, post the topmost build error, and the call stack if relevant. * A complete build log is located at '/var/tmp/portage/gnome-base/gnome-panel-2.20.1/temp/build.log'. *