user@three:~/iphone-dev/projects/Wallpaper$ sudo make all arm-apple-darwin-gcc -c -Wall -pipe -ansi -O3 SplashView.m -o SplashView.o In file included from /usr/local/lib/gcc/arm-apple-darwin/4.0.1/../../../../arm-apple-darwin/include/Foundation/Foundation.h:13, from /usr/local/lib/gcc/arm-apple-darwin/4.0.1/../../../../arm-apple-darwin/include/UIKit/UIKit.h:5, from SplashView.h:6, from SplashView.m:6: /usr/local/lib/gcc/arm-apple-darwin/4.0.1/../../../../arm-apple-darwin/include/Foundation/NSAffineTransform.h:14: error: field â_transformStructâ has incomplete type /usr/local/lib/gcc/arm-apple-darwin/4.0.1/../../../../arm-apple-darwin/include/Foundation/NSAffineTransform.h:14: error: instance variable â_transformStructâ has unknown size In file included from /usr/local/lib/gcc/arm-apple-darwin/4.0.1/../../../../arm-apple-darwin/include/Foundation/Foundation.h:16, from /usr/local/lib/gcc/arm-apple-darwin/4.0.1/../../../../arm-apple-darwin/include/UIKit/UIKit.h:5, from SplashView.h:6, from SplashView.m:6: /usr/local/lib/gcc/arm-apple-darwin/4.0.1/../../../../arm-apple-darwin/include/Foundation/NSAttributedString.h:41: error: syntax error before âNSMutableStringâ /usr/local/lib/gcc/arm-apple-darwin/4.0.1/../../../../arm-apple-darwin/include/Foundation/NSAttributedString.h:43: fatal error: method definition not in @implementation context compilation terminated. {standard input}:2:FATAL:.abort detected. Assembly stopping. make: *** [SplashView.o] Error 1 user@three:~/iphone-dev/projects/Wallpaper$