Making install in yahoo make[3]: Entering directory `/home/amonkey/install/gaim-2.0.0beta3/src/protocols/yahoo' make[3]: *** No rule to make target `install'. Stop. make[3]: Leaving directory `/home/amonkey/install/gaim-2.0.0beta3/src/protocols/yahoo' make[2]: *** [install-recursive] Error 1 make[2]: Leaving directory `/home/amonkey/install/gaim-2.0.0beta3/src/protocols'make[1]: *** [install-recursive] Error 1 make[1]: Leaving directory `/home/amonkey/install/gaim-2.0.0beta3/src' make: *** [install-recursive] Error 1 **** Installation failed. Aborting package creation. Restoring overwritten files from backup...OK Cleaning up...OK Bye.