------------------------------------------------------- T E S T S ------------------------------------------------------- Running com.campgroundautomation.sunrise.test.controlunit.ControlUnitTest Stable Library ========================================= Native lib Version = RXTX-2.1-7 Java lib Version = RXTX-2.1-7 Tests run: 1, Failures: 0, Errors: 1, Skipped: 0, Time elapsed: 0.301 sec <<< FAILURE! Results : Tests in error: com.campgroundautomation.sunrise.test.controlunit.ControlUnitTest Tests run: 1, Failures: 0, Errors: 1, Skipped: 0 Experimental: JNI_OnLoad called. [INFO] ------------------------------------------------------------------------ [ERROR] BUILD FAILURE [INFO] ------------------------------------------------------------------------ [INFO] There are test failures.