[ 11%] Built target klibloadertestmodule4 /usr/bin/make -f kdeui/CMakeFiles/kdeui.dir/build.make kdeui/CMakeFiles/kdeui.dir/depend make[2]: Entering directory `/home/kde-devel/kde/build/kdelibs' /usr/bin/cmake -E cmake_progress_report /home/kde-devel/kde/build/kdelibs/CMakeFiles [ 11%] Generating org.kde.KWallet.xml cd /home/kde-devel/kde/build/kdelibs/kdeui && /usr/bin/qdbuscpp2xml /home/kde-devel/kde/src/kdelibs/kio/misc/kwalletd/kwalletdadaptor.h > /home/kde-devel/kde/build/kdelibs/kdeui/org.kde.KWallet.xml qdbuscpp2xml: could not execute moc! Aborting. make[2]: *** [kdeui/org.kde.KWallet.xml] Error 1 make[2]: Leaving directory `/home/kde-devel/kde/build/kdelibs' make[1]: *** [kdeui/CMakeFiles/kdeui.dir/all] Error 2 make[1]: Leaving directory `/home/kde-devel/kde/build/kdelibs' make: *** [all] Error 2 makeobj[0]: Leaving directory `/home/kde-devel/kde/build/kdelibs' kde-devel@emil-laptop:~/kde/src/kdelibs$