CC usbstack/usb_storage.c usbstack/usb_storage.c: In function â?~usb_storage_transfer_completeâ?T: usbstack/usb_storage.c:240: warning: empty body in an if-statement usbstack/usb_storage.c:281: warning: empty body in an if-statement usbstack/usb_storage.c:287: warning: empty body in an if-statement usbstack/usb_storage.c:294: warning: empty body in an if-statement usbstack/usb_storage.c:312: warning: empty body in an if-statement usbstack/usb_storage.c: In function â?~identify2inquiryâ?T: usbstack/usb_storage.c:677: error: â?~_inquiryâ?T undeclared (first use in this function) usbstack/usb_storage.c:677: error: (Each undeclared identifier is reported only once usbstack/usb_storage.c:677: error: for each function it appears in.) make[1]: *** [/home/jens/rockbox/build/mini2g/firmware/usbstack/usb_storage.o] Error 1 make: *** [build] Fehler 2