make[2]: Entering directory `/home/suckzor/tremWT' LD build/release-linux-x86/tremded.x86 build/release-linux-x86/ded/sv_game.o: In function `SV_GameSystemCalls': sv_game.c:(.text+0xe09): undefined reference to `nettle_mpz_init_set_str_256_u' sv_game.c:(.text+0xe1f): undefined reference to `__gmpz_get_str' sv_game.c:(.text+0xe2d): undefined reference to `nettle_rsa_public_key_init' sv_game.c:(.text+0xe41): undefined reference to `__gmpz_set_ui' sv_game.c:(.text+0xe5e): undefined reference to `__gmpz_set_str' sv_game.c:(.text+0xe73): undefined reference to `nettle_rsa_public_key_clear' sv_game.c:(.text+0xe89): undefined reference to `__gmpz_get_str' sv_game.c:(.text+0xe91): undefined reference to `__gmpz_clear' sv_game.c:(.text+0x126d): undefined reference to `nettle_rsa_public_key_prepare' sv_game.c:(.text+0x1284): undefined reference to `nettle_rsa_encrypt' build/release-linux-x86/ded/crypto.o: In function `CRYPTO_Init': crypto.c:(.text+0x21): undefined reference to `__gmp_set_memory_functions' build/release-linux-x86/ded/crypto.o: In function `qnettle_buffer_init': crypto.c:(.text+0x41): undefined reference to `nettle_buffer_init_realloc' collect2: ld returned 1 exit status make[2]: *** [build/release-linux-x86/tremded.x86] Error 1 make[2]: Leaving directory `/home/suckzor/tremWT' make[1]: *** [targets] Error 2 make[1]: Leaving directory `/home/suckzor/tremWT' make: *** [release] Error 2