... gcc: /usr/lib64/mysql/libmysqlclient.so: No such file or directory make[2]: *** [ommysql.la] Error 1 make[2]: Leaving directory `/home/jkeiper/rpmbuild/BUILD/rsyslog-2.0.2/plugins/ommysql' make[1]: *** [all-recursive] Error 1 make[1]: Leaving directory `/home/jkeiper/rpmbuild/BUILD/rsyslog-2.0.2' make: *** [all] Error 2 error: Bad exit status from /var/tmp/rpm-tmp.81349 (%build) RPM build errors: user mockbuild does not exist - using root group mockbuild does not exist - using root user mockbuild does not exist - using root group mockbuild does not exist - using root user mockbuild does not exist - using root group mockbuild does not exist - using root user mockbuild does not exist - using root group mockbuild does not exist - using root Bad exit status from /var/tmp/rpm-tmp.81349 (%build)