gcc -g -O2 -Wall -Wcast-align -Wshadow -Wstrict-prototypes -Wpointer-arith -o .libs/version version.o ../src/.libs/libgcrypt.so -Wl,--rpath -Wl,/home/xavivars/local/lib ../src/.libs/libgcrypt.so: undefined reference to `gpg_err_code_from_syserror' collect2: ld returned 1 exit status make[2]: *** [version] Error 1 make[2]: Leaving directory `/home/.lemonade/xavivars/src/libgcrypt-1.4.0/tests' make[1]: *** [all-recursive] Error 1 make[1]: Leaving directory `/home/.lemonade/xavivars/src/libgcrypt-1.4.0' make: *** [all] Error 2