[ 5%] Building CXX object multimedia/amarok/src/context/CMakeFiles/amarokplasma.dir/plasma/containment.o /home/bart/code/KDE/trunk/KDE/extragear/multimedia/amarok/src/context/plasma/containment.cpp: In member function ‘virtual void Plasma::Containment::init()’: /home/bart/code/KDE/trunk/KDE/extragear/multimedia/amarok/src/context/plasma/containment.cpp:121: fout: ‘NoCache’ was not declared in this scope /home/bart/code/KDE/trunk/KDE/extragear/multimedia/amarok/src/context/plasma/containment.cpp:121: fout: ‘setCacheMode’ was not declared in this scope make[2]: *** [multimedia/amarok/src/context/CMakeFiles/amarokplasma.dir/plasma/containment.o] Fout 1 make[1]: *** [multimedia/amarok/src/context/CMakeFiles/amarokplasma.dir/all] Fout 2 make: *** [all] Fout 2